Target
Hypoxia-inducible factor 1-alpha inhibitor
Ligand
BDBM50361473
Substrate
Meas. Tech.
ChEMBL_797225 (CHEMBL1942540)
IC50
21000±n/a nM
Citation
 Suzuki, TMiyata, N Lysine demethylases inhibitors. J Med Chem 54:8236-50 (2011)  
Target
Name:
Hypoxia-inducible factor 1-alpha inhibitor
Synonyms:
FIH1 HIF1N_HUMAN Hypoxia-inducible factor 1-alpha inhibitor
Type:
Enzyme
Mol. Mass.:
40278.92
Organism:
Homo sapiens (Human)
Description:
Q9NWT6
Residue:
349
  
Inhibitor
Name:
BDBM50361473
Synonyms:
CHEMBL1435274
Type:
Small organic molecule
Emp. Form.:
C10H7NO3
Mol. Mass.:
189.1675
SMILES:
OC(=O)c1ccnc2c(O)cccc12
: