Target
Lysine-specific demethylase 4A
Ligand
BDBM50324535
Substrate
Meas. Tech.
ChEMBL_797220 (CHEMBL1942535)
IC50
3000±n/a nM
Citation
 Suzuki, TMiyata, N Lysine demethylases inhibitors. J Med Chem 54:8236-50 (2011)  
Target
Name:
Lysine-specific demethylase 4A
Synonyms:
JHDM3A JMJD2A Jumonji domain-containing protein 2A KDM4A_HUMAN Lysine-specific demethylase 4A | Lysine-specific demethylase 4A (KDM4A)
Type:
Enzyme
Mol. Mass.:
120647.83
Organism:
Homo sapiens (Human)
Description:
O75164
Residue:
1064
  
Inhibitor
Name:
BDBM50324535
Synonyms:
3-{[9-(Dimethylamino)nonanoyl](hydroxy)amino}propanoicAcid Hydrochloride CHEMBL1229308
Type:
Small organic molecule
Emp. Form.:
C14H28N2O4
Mol. Mass.:
288.3831
SMILES:
CN(C)CCCCCCCCC(=O)N(O)CCC(O)=O
: