Target
Prolyl hydroxylase EGLN2
Ligand
BDBM50324535
Substrate
Meas. Tech.
ChEMBL_797226 (CHEMBL1942541)
IC50
>100000±n/a nM
Citation
 Suzuki, TMiyata, N Lysine demethylases inhibitors. J Med Chem 54:8236-50 (2011)  
Target
Name:
Prolyl hydroxylase EGLN2
Synonyms:
EGLN2 EIT6 Estrogen-induced tag 6 HIF-PH1 HPH-3 PHD1 Prolyl hydroxylase domain-containing protein 1 (PHD1)
Type:
Protein
Mol. Mass.:
43657.01
Organism:
Homo sapiens (Human)
Description:
Q96KS0
Residue:
407
  
Inhibitor
Name:
BDBM50324535
Synonyms:
3-{[9-(Dimethylamino)nonanoyl](hydroxy)amino}propanoicAcid Hydrochloride CHEMBL1229308
Type:
Small organic molecule
Emp. Form.:
C14H28N2O4
Mol. Mass.:
288.3831
SMILES:
CN(C)CCCCCCCCC(=O)N(O)CCC(O)=O
: