Target
Amine oxidase [flavin-containing] B
Ligand
BDBM50236898
Substrate
Meas. Tech.
ChEMBL_797216 (CHEMBL1942531)
Ki
16000±n/a nM
Citation
 Suzuki, TMiyata, N Lysine demethylases inhibitors. J Med Chem 54:8236-50 (2011)  
Target
Name:
Amine oxidase [flavin-containing] B
Synonyms:
AOFB_HUMAN MAOB Monoamine oxidase type B (MAO B) Monoamine oxidase type B (MAOB)
Type:
Protein
Mol. Mass.:
58768.76
Organism:
Homo sapiens (Human)
Description:
P27338
Residue:
520
  
Inhibitor
Name:
BDBM50236898
Synonyms:
(1S,2R)-(+)-2-phenylcyclopropylamine TRANYLCYPROMINE trans-2-phenylcyclopropanamine | trans-2-phenylcyclopropylamine
Type:
Small organic molecule
Emp. Form.:
C9H11N
Mol. Mass.:
133.1903
SMILES:
N[C@H]1C[C@@H]1c1ccccc1
: