Target
Amine oxidase [flavin-containing] A
Ligand
BDBM50346864
Substrate
Meas. Tech.
ChEMBL_797214 (CHEMBL1942529)
Ki
1200±n/a nM
Citation
 Suzuki, TMiyata, N Lysine demethylases inhibitors. J Med Chem 54:8236-50 (2011)  
Target
Name:
Amine oxidase [flavin-containing] A
Synonyms:
AOFA_HUMAN MAO-A Monoamine oxidase Monoamine oxidase type A (MAO A) Monoamine oxidase type A (MAOA)
Type:
Protein
Mol. Mass.:
59689.53
Organism:
Homo sapiens (Human)
Description:
P21397
Residue:
527
  
Inhibitor
Name:
BDBM50346864
Synonyms:
CHEMBL1797641 US8765820, 8
Type:
Small organic molecule
Emp. Form.:
C26H27N3O3
Mol. Mass.:
429.5109
SMILES:
NC1CC1c1ccc(NC(=O)C(Cc2ccccc2)NC(=O)OCc2ccccc2)cc1
: