Target
Amine oxidase [flavin-containing] A
Ligand
BDBM50361609
Substrate
Meas. Tech.
ChEMBL_799139 (CHEMBL1942123)
Ki
0.8±n/a nM
Citation
 Valente, STomassi, STempera, GSaccoccio, SAgostinelli, EMai, A Novel reversible monoamine oxidase A inhibitors: highly potent and selective 3-(1H-pyrrol-3-yl)-2-oxazolidinones. J Med Chem 54:8228-32 (2011)  
Target
Name:
Amine oxidase [flavin-containing] A
Synonyms:
AOFA_BOVIN MAO-A Monoamine Oxidase Type A (MAO-A) Monoamine oxidase A | Monoamine oxidase type A
Type:
PROTEIN
Mol. Mass.:
59764.63
Organism:
Bos taurus
Description:
ChEMBL_1501477
Residue:
527
  
Inhibitor
Name:
BDBM50361609
Synonyms:
CHEMBL1939853
Type:
Small organic molecule
Emp. Form.:
C10H13N5O2
Mol. Mass.:
235.2425
SMILES:
CCn1ccc(c1)N1C[C@H](CN=[N+]=[N-])OC1=O
: