Target
3-beta-hydroxysteroid-Delta(8),Delta(7)-isomerase
Ligand
BDBM50334158
Substrate
Meas. Tech.
ChEMBL_799951 (CHEMBL1941657)
Ki
211±n/a nM
Citation
 Maisonial, AGrosse Maestrup, EWiese, CHiller, ASchepmann, DFischer, SDeuther-Conrad, WSteinbach, JBrust, PWünsch, B Synthesis, radiofluorination and pharmacological evaluation of a fluoromethyl spirocyclic PET tracer for centrals1 receptors and comparison with fluoroalkyl homologs. Bioorg Med Chem 20:257-69 (2011)  
Target
Name:
3-beta-hydroxysteroid-Delta(8),Delta(7)-isomerase
Synonyms:
3-beta-hydroxysteroid-Delta(8),Delta(7)-isomerase/Delta(24)-sterol reductase Anti-estrogen binding site (AEBS) D8-D7 sterol isomerase EBP Emopamil-binding protein
Type:
PROTEIN
Mol. Mass.:
26358.51
Organism:
Homo sapiens (Human)
Description:
ChEMBL_873432
Residue:
230
  
Inhibitor
Name:
BDBM50334158
Synonyms:
1'-benzyl-3-(2-fluoroethyl)-3H-spiro[[2]benzofuran-1,4'-piperidine CHEMBL2314421
Type:
Small organic molecule
Emp. Form.:
C21H24FNO
Mol. Mass.:
325.4198
SMILES:
FCCC1OC2(CCN(Cc3ccccc3)CC2)c2ccccc12
: