Target
Vascular endothelial growth factor receptor 3
Ligand
BDBM50362069
Substrate
Meas. Tech.
ChEMBL_797354 (CHEMBL1942930)
IC50
30±n/a nM
Citation
 Plé, PAJung, FAshton, SHennequin, LLaine, RMorgentin, RPasquet, GTaylor, S Discovery of AZD2932, a new Quinazoline Ether Inhibitor with high affinity for VEGFR-2 and PDGFR tyrosine kinases. Bioorg Med Chem Lett 22:262-6 (2011)  
Target
Name:
Vascular endothelial growth factor receptor 3
Synonyms:
FLT-4 Fms-like tyrosine kinase 4 VEGFR-3 VGFR3_HUMAN Vascular endothelial growth factor receptor 3 (VEGFR-3) | Vascular endothelial growth factor receptor 3 (VEGFR3)
Type:
Protein
Mol. Mass.:
152749.58
Organism:
Homo sapiens (Human)
Description:
P35916-2
Residue:
1363
  
Inhibitor
Name:
BDBM50362069
Synonyms:
CHEMBL1940113
Type:
Small organic molecule
Emp. Form.:
C22H21N5O5
Mol. Mass.:
435.4326
SMILES:
COc1cccc(NC(=O)Cn2cc(Oc3ncnc4cc(OC)cc(OC)c34)cn2)c1
: