Target
Macrophage colony-stimulating factor 1 receptor
Ligand
BDBM50362067
Substrate
Meas. Tech.
ChEMBL_797355 (CHEMBL1942931)
IC50
400±n/a nM
Citation
 Plé, PAJung, FAshton, SHennequin, LLaine, RMorgentin, RPasquet, GTaylor, S Discovery of AZD2932, a new Quinazoline Ether Inhibitor with high affinity for VEGFR-2 and PDGFR tyrosine kinases. Bioorg Med Chem Lett 22:262-6 (2011)  
Target
Name:
Macrophage colony-stimulating factor 1 receptor
Synonyms:
CSF1R FMS Macrophage colony stimulating factor receptor Macrophage colony-stimulating factor 1 receptor (c-FMS) Proto-oncogene c-Fms c-fms | cFMS
Type:
Protein
Mol. Mass.:
107979.48
Organism:
Homo sapiens (Human)
Description:
P07333
Residue:
972
  
Inhibitor
Name:
BDBM50362067
Synonyms:
CHEMBL1940111
Type:
Small organic molecule
Emp. Form.:
C28H32N6O5
Mol. Mass.:
532.5909
SMILES:
COc1cccc(NC(=O)Cn2cc(Oc3ncnc4cc(OC)c(OCCN5CCCCC5)cc34)cn2)c1
: