Target
Macrophage colony-stimulating factor 1 receptor
Ligand
BDBM50362068
Substrate
Meas. Tech.
ChEMBL_797355 (CHEMBL1942931)
IC50
30±n/a nM
Citation
 Plé, PAJung, FAshton, SHennequin, LLaine, RMorgentin, RPasquet, GTaylor, S Discovery of AZD2932, a new Quinazoline Ether Inhibitor with high affinity for VEGFR-2 and PDGFR tyrosine kinases. Bioorg Med Chem Lett 22:262-6 (2011)  
Target
Name:
Macrophage colony-stimulating factor 1 receptor
Synonyms:
CSF1R FMS Macrophage colony stimulating factor receptor Macrophage colony-stimulating factor 1 receptor (c-FMS) Proto-oncogene c-Fms c-fms | cFMS
Type:
Protein
Mol. Mass.:
107979.48
Organism:
Homo sapiens (Human)
Description:
P07333
Residue:
972
  
Inhibitor
Name:
BDBM50362068
Synonyms:
CHEMBL1940112
Type:
Small organic molecule
Emp. Form.:
C27H30N6O5
Mol. Mass.:
518.5643
SMILES:
COc1cccc(NC(=O)Cn2cc(Oc3ncnc4cc(OCCN5CCCC5)c(OC)cc34)cn2)c1
: