Target
Receptor-type tyrosine-protein kinase FLT3
Ligand
BDBM50362072
Substrate
Meas. Tech.
ChEMBL_797357 (CHEMBL1942933)
IC50
4±n/a nM
Citation
 Plé, PAJung, FAshton, SHennequin, LLaine, RMorgentin, RPasquet, GTaylor, S Discovery of AZD2932, a new Quinazoline Ether Inhibitor with high affinity for VEGFR-2 and PDGFR tyrosine kinases. Bioorg Med Chem Lett 22:262-6 (2011)  
Target
Name:
Receptor-type tyrosine-protein kinase FLT3
Synonyms:
CD135 FL cytokine receptor FLK2 FLT3 Fetal liver kinase-2 Fms-like tyrosine kinase 3 (Flt-3) STK-1 Stem cell tyrosine kinase 1
Type:
Enzyme
Mol. Mass.:
112888.62
Organism:
Homo sapiens (Human)
Description:
P36888
Residue:
993
  
Inhibitor
Name:
BDBM50362072
Synonyms:
CHEMBL1940116
Type:
Small organic molecule
Emp. Form.:
C20H21N7O4
Mol. Mass.:
423.4252
SMILES:
CCn1cc(NC(=O)Cn2cc(Oc3ncnc4cc(OC)c(OC)cc34)cn2)cn1
: