Target
Induced myeloid leukemia cell differentiation protein Mcl-1
Ligand
BDBM50362149
Substrate
Meas. Tech.
ChEMBL_797477 (CHEMBL1943220)
Ki
4160±n/a nM
Citation
 Zheng, CHYang, HZhang, MLu, SHShi, DWang, JChen, XHRen, XHLiu, JLv, JGZhu, JZhou, YJ Design, synthesis, and activity evaluation of broad-spectrum small-molecule inhibitors of anti-apoptotic Bcl-2 family proteins: characteristics of broad-spectrum protein binding and its effects on anti-tumor activity. Bioorg Med Chem Lett 22:39-44 (2011)  
Target
Name:
Induced myeloid leukemia cell differentiation protein Mcl-1
Synonyms:
BCL2L3 Bcl-2-like protein 3 (Mcl-1) Bcl2-L-3 MCL1 Mcl-1 Myeloid cell leukemia sequence 1 (BCL2-related) | mcl1/EAT
Type:
Membrane; Single-pass membrane protein
Mol. Mass.:
37332.87
Organism:
Homo sapiens (Human)
Description:
Q07820
Residue:
350
  
Inhibitor
Name:
BDBM50362149
Synonyms:
CHEMBL1940668
Type:
Small organic molecule
Emp. Form.:
C28H24N4O6S2
Mol. Mass.:
576.643
SMILES:
[O-][N+](=O)c1cc(ccc1NCCSc1ccccc1)S(=O)(=O)NC(=O)c1ccc(NC(=O)c2ccccc2)cc1
: