Target
Bcl-2-like protein 1
Ligand
BDBM50362151
Substrate
Meas. Tech.
ChEMBL_797475 (CHEMBL1943218)
Ki
2080±n/a nM
Citation
 Zheng, CHYang, HZhang, MLu, SHShi, DWang, JChen, XHRen, XHLiu, JLv, JGZhu, JZhou, YJ Design, synthesis, and activity evaluation of broad-spectrum small-molecule inhibitors of anti-apoptotic Bcl-2 family proteins: characteristics of broad-spectrum protein binding and its effects on anti-tumor activity. Bioorg Med Chem Lett 22:39-44 (2011)  
Target
Name:
Bcl-2-like protein 1
Synonyms:
Anti-apoptotic Bcl-2 protein Apoptosis regulator Bcl-X BCL2-like 1 isoform 1 BCL2L1 Bcl-2-like protein 1 (Bcl-XL) Bcl-xL/Bcl-2-binding component 3 Bcl2-antagonist of cell death (BAD)
Type:
Mitochondrion membrane; Single-pass membrane protein
Mol. Mass.:
26039.60
Organism:
Homo sapiens (Human)
Description:
Residue:
233
  
Inhibitor
Name:
BDBM50362151
Synonyms:
CHEMBL1940670
Type:
Small organic molecule
Emp. Form.:
C28H23FN4O6S2
Mol. Mass.:
594.634
SMILES:
[O-][N+](=O)c1cc(ccc1NCCSc1ccccc1)S(=O)(=O)NC(=O)c1ccc(NC(=O)c2cccc(F)c2)cc1
: