Target
B1 bradykinin receptor
Ligand
BDBM50362319
Substrate
Meas. Tech.
ChEMBL_797692 (CHEMBL1943912)
IC50
23.4±n/a nM
Citation
 Qian, WChen, JJHuman, JAya, TZhu, JBiswas, KPeterkin, THungate, RWArik, LJohnson, EKumar, GJoseph, SJona, JGuo, HXWu, Z Discovery of dehydro-oxopiperazine acetamides as novel bradykinin B1 receptor antagonists with enhanced in vitro potency. Bioorg Med Chem Lett 22:1061-7 (2012)  
Target
Name:
B1 bradykinin receptor
Synonyms:
B1 BRADYKININ B1R BK-1 receptor BRADYB1 | Bradykinin B1 receptor
Type:
Enzyme
Mol. Mass.:
40508.87
Organism:
Homo sapiens (Human)
Description:
P46663
Residue:
353
  
Inhibitor
Name:
BDBM50362319
Synonyms:
CHEMBL1939950
Type:
Small organic molecule
Emp. Form.:
C24H33ClN4O4S
Mol. Mass.:
509.061
SMILES:
Cc1cc(c(C)cc1Cl)S(=O)(=O)N1C=CNC(=O)[C@H]1CC(=O)N1CCCC[C@@H](C1)N1CCCC1
: