Target
B1 bradykinin receptor
Ligand
BDBM50362328
Substrate
Meas. Tech.
ChEMBL_797692 (CHEMBL1943912)
IC50
0.28±n/a nM
Citation
 Qian, WChen, JJHuman, JAya, TZhu, JBiswas, KPeterkin, THungate, RWArik, LJohnson, EKumar, GJoseph, SJona, JGuo, HXWu, Z Discovery of dehydro-oxopiperazine acetamides as novel bradykinin B1 receptor antagonists with enhanced in vitro potency. Bioorg Med Chem Lett 22:1061-7 (2012)  
Target
Name:
B1 bradykinin receptor
Synonyms:
B1 BRADYKININ B1R BK-1 receptor BRADYB1 | Bradykinin B1 receptor
Type:
Enzyme
Mol. Mass.:
40508.87
Organism:
Homo sapiens (Human)
Description:
P46663
Residue:
353
  
Inhibitor
Name:
BDBM50362328
Synonyms:
CHEMBL1939941
Type:
Small organic molecule
Emp. Form.:
C19H24Cl2N4O4S
Mol. Mass.:
475.389
SMILES:
CC1(C)CNCC[C@@H]1NC(=O)C[C@H]1N(C=CNC1=O)S(=O)(=O)c1cccc(Cl)c1Cl
: