Target
B1 bradykinin receptor
Ligand
BDBM50362335
Substrate
Meas. Tech.
ChEMBL_797692 (CHEMBL1943912)
IC50
0.51±n/a nM
Citation
 Qian, WChen, JJHuman, JAya, TZhu, JBiswas, KPeterkin, THungate, RWArik, LJohnson, EKumar, GJoseph, SJona, JGuo, HXWu, Z Discovery of dehydro-oxopiperazine acetamides as novel bradykinin B1 receptor antagonists with enhanced in vitro potency. Bioorg Med Chem Lett 22:1061-7 (2012)  
Target
Name:
B1 bradykinin receptor
Synonyms:
B1 BRADYKININ B1R BK-1 receptor BRADYB1 | Bradykinin B1 receptor
Type:
Enzyme
Mol. Mass.:
40508.87
Organism:
Homo sapiens (Human)
Description:
P46663
Residue:
353
  
Inhibitor
Name:
BDBM50362335
Synonyms:
CHEMBL1939933
Type:
Small organic molecule
Emp. Form.:
C23H34N4O4S
Mol. Mass.:
462.605
SMILES:
CCCN1CC[C@H](NC(=O)C[C@H]2N(C=CNC2=O)S(=O)(=O)c2ccc(C)cc2)C(C)(C)C1
: