Target
Glycogen synthase kinase-3 beta
Ligand
BDBM50362511
Substrate
Meas. Tech.
ChEMBL_798474 (CHEMBL1944323)
IC50
1.4±n/a nM
Citation
 Li, BCociorva, OMNomanbhoy, TLi, QNakamura, KNomura, MOkada, KYumoto, KLiyanage, MZhang, MCAban, ASzardenings, AKKozarich, JWKohno, YShreder, KR 6-Position optimization of tricyclic 4-quinolone-based inhibitors of glycogen synthase kinase-3ß: discovery of nitrile derivatives with picomolar potency. Bioorg Med Chem Lett 22:1005-8 (2012)  
Target
Name:
Glycogen synthase kinase-3 beta
Synonyms:
GSK-3 beta GSK3B Glycogen synthase kinase 3 beta (GSK3B) Glycogen synthase kinase-3 beta (GSK-3B) Glycogen synthase kinase-3 beta (GSK3B) Glycogen synthase kinase-3beta (GSK3B) | Serine/threonine-protein kinase GSK3B
Type:
Enzyme
Mol. Mass.:
46756.38
Organism:
Homo sapiens (Human)
Description:
P49841
Residue:
420
  
Inhibitor
Name:
BDBM50362511
Synonyms:
CHEMBL1940979
Type:
Small organic molecule
Emp. Form.:
C22H21FN4O2
Mol. Mass.:
392.4261
SMILES:
C[C@H]1COc2c(NCCCc3ccccc3)c(F)c(N)c3c2n1cc(C#N)c3=O
: