Target
ALK tyrosine kinase receptor
Ligand
BDBM50362781
Substrate
Meas. Tech.
ChEMBL_797904 (CHEMBL1942591)
IC50
1.9±n/a nM
Citation
 Kinoshita, KAsoh, KFuruichi, NIto, TKawada, HHara, SOhwada, JMiyagi, TKobayashi, TTakanashi, KTsukaguchi, TSakamoto, HTsukuda, TOikawa, N Design and synthesis of a highly selective, orally active and potent anaplastic lymphoma kinase inhibitor (CH5424802). Bioorg Med Chem 20:1271-80 (2012)  
Target
Name:
ALK tyrosine kinase receptor
Synonyms:
ALK ALK_HUMAN CD_antigen: CD246
Type:
Protein
Mol. Mass.:
176453.10
Organism:
Homo sapiens (Human)
Description:
Q9UM73
Residue:
1620
  
Inhibitor
Name:
BDBM50362781
Synonyms:
1256580-46-7 Alecensa CH5424802 US10851092, Example Alectinib US9126931, 366
Type:
Small organic molecule
Emp. Form.:
C30H34N4O2
Mol. Mass.:
482.6166
SMILES:
CCc1cc2C(=O)c3c([nH]c4cc(ccc34)C#N)C(C)(C)c2cc1N1CCC(CC1)N1CCOCC1
: