Target
Aldo-keto reductase family 1 member B10
Ligand
BDBM50029198
Substrate
Meas. Tech.
ChEMBL_798534 (CHEMBL1942331)
IC50
210±n/a nM
Citation
 Soda, MHu, DEndo, STakemura, MLi, JWada, RIfuku, SZhao, HTEl-Kabbani, OOhta, SYamamura, KToyooka, NHara, AMatsunaga, T Design, synthesis and evaluation of caffeic acid phenethyl ester-based inhibitors targeting a selectivity pocket in the active site of human aldo-keto reductase 1B10. Eur J Med Chem 48:321-9 (2012)  
Target
Name:
Aldo-keto reductase family 1 member B10
Synonyms:
AK1BA_HUMAN AKR1B11 ARP Aldo-keto reductase family 1 member B10 (AKR1B10) Aldose reductase-like SI reductase hARP
Type:
Protein
Mol. Mass.:
36024.67
Organism:
Homo sapiens (Human)
Description:
O60218. 1ZUA; 4JII; 4GQ0
Residue:
316
  
Inhibitor
Name:
BDBM50029198
Synonyms:
(E)-3-(3,4-Dihydroxy-phenyl)-acrylic acid benzyl ester 3-(3,4-Dihydroxy-phenyl)-acrylic acid benzyl ester Phenylmethyl 1-(3',4'-dihydroxyphenyl)propenate benzyl caffeate
Type:
Small organic molecule
Emp. Form.:
C16H14O4
Mol. Mass.:
270.28
SMILES:
Oc1ccc(\C=C\C(=O)OCc2ccccc2)cc1O
: