Target
Peroxisome proliferator-activated receptor gamma
Ligand
BDBM50362950
Substrate
Meas. Tech.
ChEMBL_801283 (CHEMBL1947832)
EC50
1±n/a nM
Citation
 Liu, WLau, FLiu, KWood, HBZhou, GChen, YLi, YAkiyama, TECastriota, GEinstein, MWang, CMcCann, MEDoebber, TWWu, MChang, CHMcNamara, LMcKeever, BMosley, RTBerger, JPMeinke, PT Benzimidazolones: a new class of selective peroxisome proliferator-activated receptor¿ (PPAR¿) modulators. J Med Chem 54:8541-54 (2011)  
Target
Name:
Peroxisome proliferator-activated receptor gamma
Synonyms:
NR1C3 PPAR-gamma PPARG_HUMAN Peroxisome proliferator-activated receptor gamma (PPAR gamma) Peroxisome proliferator-activated receptor gamma (PPARĪ³) peroxisome proliferator-activated receptor gamma isoform 2
Type:
Nuclear Receptor
Mol. Mass.:
57613.46
Organism:
Homo sapiens (Human)
Description:
P37231
Residue:
505
  
Inhibitor
Name:
BDBM50362950
Synonyms:
CHEMBL1946409
Type:
Small organic molecule
Emp. Form.:
C21H21F3N2O5
Mol. Mass.:
438.397
SMILES:
CN(CCOc1ccc(C[C@H](OCC(F)(F)F)C(O)=O)cc1)c1nc2ccccc2o1
: