Target
ATP-binding cassette sub-family C member 8
Ligand
BDBM50363011
Substrate
Meas. Tech.
ChEMBL_800636 (CHEMBL1947668)
IC50
1750±n/a nM
Citation
 de Tullio, PServais, ACFillet, MGillotin, FSomers, FChiap, PLebrun, PPirotte, B Hydroxylated analogues of ATP-sensitive potassium channel openers belonging to the group of 6- and/or 7-substituted 3-isopropylamino-4H-1,2,4-benzothiadiazine 1,1-dioxides: toward an improvement in sulfonylurea receptor 1 selectivity and metabolism stability. J Med Chem 54:8353-61 (2011)  
Target
Name:
ATP-binding cassette sub-family C member 8
Synonyms:
ABCC8_RAT Sulfonylurea receptor 1 Sur1
Type:
PROTEIN
Mol. Mass.:
177210.63
Organism:
Rattus norvegicus
Description:
ChEMBL_800636
Residue:
1582
  
Inhibitor
Name:
BDBM50363011
Synonyms:
CHEMBL189093
Type:
Small organic molecule
Emp. Form.:
C11H15N3O3S
Mol. Mass.:
269.32
SMILES:
COc1ccc2N=C(NC(C)C)NS(=O)(=O)c2c1
: