Target
Cytochrome P450 2D6
Ligand
BDBM50363196
Substrate
Meas. Tech.
ChEMBL_800477 (CHEMBL1948597)
IC50
950±n/a nM
Citation
 William, ADLee, ACGoh, KCBlanchard, SPoulsen, ATeo, ELNagaraj, HLee, CPWang, HWilliams, MSun, ETHu, CJayaraman, RPasha, MKEthirajulu, KWood, JMDymock, BW Discovery of kinase spectrum selective macrocycle (16E)-14-methyl-20-oxa-5,7,14,26-tetraazatetracyclo[19.3.1.1(2,6).1(8,12)]heptacosa-1(25),2(26),3,5,8(27),9,11,16,21,23-decaene (SB1317/TG02), a potent inhibitor of cyclin dependent kinases (CDKs), Janus kinase 2 (JAK2), and fms-like tyrosine kinase J Med Chem 55:169-96 (2012)  
Target
Name:
Cytochrome P450 2D6
Synonyms:
CP2D6_HUMAN CYP2DL1 Cytochrome P450 2D6 (CYP2D6) P450-DB1
Type:
Protein
Mol. Mass.:
55774.82
Organism:
Homo sapiens (Human)
Description:
P10635
Residue:
497
  
Inhibitor
Name:
BDBM50363196
Synonyms:
CHEMBL1944698
Type:
Small organic molecule
Emp. Form.:
C23H24N4O
Mol. Mass.:
372.4629
SMILES:
CN1C\C=C\CCOc2cccc(c2)-c2ccnc(Nc3cccc(C1)c3)n2
: