Target
Potassium voltage-gated channel subfamily H member 2
Ligand
BDBM50363317
Substrate
Meas. Tech.
ChEMBL_801100 (CHEMBL1948885)
IC50
>30000±n/a nM
Citation
 Tao, MAimone, LDGruner, JAMathiasen, JRHuang, ZLyons, JRaddatz, RHudkins, RL Synthesis and structure-activity relationship of 5-pyridazin-3-one phenoxypiperidines as potent, selective histamine H(3) receptor inverse agonists. Bioorg Med Chem Lett 22:1073-7 (2012)  
Target
Name:
Potassium voltage-gated channel subfamily H member 2
Synonyms:
1,3-beta-glucan synthase component GLS2 ERG Eag-related protein 1 Ether-a-go-go-related gene (HERG) Ether-a-go-go-related gene potassium channel 1 Ether-a-go-go-related gene potassium channel 1 (hERG1) Ether-a-go-go-related protein 1 H-ERG KCNH2 Potassium voltage-gated channel subfamily H member 2 (hERG) Voltage-gated potassium channel subunit Kv11.1 hERG Potassium Channel 1 | putative potassium channel subunit
Type:
Multi-pass membrane protein
Mol. Mass.:
126672.65
Organism:
Homo sapiens (Human)
Description:
Q12809
Residue:
1159
  
Inhibitor
Name:
BDBM50363317
Synonyms:
CHEMBL1945848
Type:
Small organic molecule
Emp. Form.:
C25H28N4O2
Mol. Mass.:
416.5154
SMILES:
Cc1nn(-c2ccccn2)c(=O)cc1-c1ccc(OC2CCN(CC2)C2CCC2)cc1
: