Target
Serine/threonine-protein kinase B-raf
Ligand
BDBM50363398
Substrate
Meas. Tech.
ChEMBL_801442 (CHEMBL1948264)
IC50
3±n/a nM
Citation
 Zambon, ANiculescu-Duvaz, INiculescu-Duvaz, DMarais, RSpringer, CJ Small molecule inhibitors of BRAF in clinical trials. Bioorg Med Chem Lett 22:789-92 (2012)  
Target
Name:
Serine/threonine-protein kinase B-raf
Synonyms:
B-RAF B-Raf proto-oncogene serine/threonine-protein kinase BRAF1 RAFB1 v-Raf murine sarcoma viral oncogene homolog B1
Type:
Serine/threonine-protein kinase
Mol. Mass.:
84446.00
Organism:
Homo sapiens (Human)
Description:
P15056
Residue:
766
  
Inhibitor
Name:
BDBM50363398
Synonyms:
CHEMBL1946171
Type:
Small organic molecule
Emp. Form.:
C24H16F6N6O
Mol. Mass.:
518.4139
SMILES:
Cn1c(Nc2ccc(cc2)C(F)(F)F)nc2ccc(Oc3ccnc(c3)-c3c[nH]c(n3)C(F)(F)F)cc12
: