Target
Steryl-sulfatase
Ligand
BDBM50363580
Substrate
Meas. Tech.
ChEMBL_801652 (CHEMBL1948910)
Ki
108±n/a nM
Citation
 Mostafa, YATaylor, SD 17ß-Arylsulfonamides of 17ß-aminoestra-1,3,5(10)-trien-3-ol as highly potent inhibitors of steroid sulfatase. Bioorg Med Chem 20:1535-44 (2012)  
Target
Name:
Steryl-sulfatase
Synonyms:
ARSC1 Arylsulfatase C STS_HUMAN Steryl-sulfate sulfohydrolase
Type:
Enzyme
Mol. Mass.:
65503.66
Organism:
Homo sapiens (Human)
Description:
P08842
Residue:
583
  
Inhibitor
Name:
BDBM50363580
Synonyms:
CHEMBL1945908
Type:
Small organic molecule
Emp. Form.:
C24H28BrNO3S
Mol. Mass.:
490.453
SMILES:
C[C@]12CC[C@H]3[C@@H](CCc4cc(O)ccc34)[C@@H]1CC[C@@H]2NS(=O)(=O)c1cccc(Br)c1
: