Target
Carbonic anhydrase
Ligand
BDBM10884
Substrate
Meas. Tech.
ChEMBL_801827 (CHEMBL1947439)
Ki
280±n/a nM
Citation
 Ohradanova, AVullo, DPastorekova, SPastorek, JJackson, DJWörheide, GSupuran, CT Cloning, characterization and sulfonamide inhibition studies of ana-carbonic anhydrase from the living fossil sponge Astrosclera willeyana. Bioorg Med Chem 20:1403-10 (2012)  
Target
Name:
Carbonic anhydrase
Synonyms:
Astrosclerin-3
Type:
PROTEIN
Mol. Mass.:
33233.07
Organism:
Astrosclera willeyana
Description:
ChEMBL_801827
Residue:
292
  
Inhibitor
Name:
BDBM10884
Synonyms:
(2S,4S)-4-(ethylamino)-2-methyl-1,1-dioxo-2H,3H,4H-1,7-thieno[2,3-b]thiopyran-6-sulfonamide Dorzolamide (DZA)
Type:
Small organic molecule
Emp. Form.:
C10H16N2O4S3
Mol. Mass.:
324.44
SMILES:
CCN[C@H]1C[C@H](C)S(=O)(=O)c2sc(cc12)S(N)(=O)=O
: