Target
Carbonic anhydrase
Ligand
BDBM10875
Substrate
Meas. Tech.
ChEMBL_801827 (CHEMBL1947439)
Ki
792±n/a nM
Citation
 Ohradanova, AVullo, DPastorekova, SPastorek, JJackson, DJWörheide, GSupuran, CT Cloning, characterization and sulfonamide inhibition studies of ana-carbonic anhydrase from the living fossil sponge Astrosclera willeyana. Bioorg Med Chem 20:1403-10 (2012)  
Target
Name:
Carbonic anhydrase
Synonyms:
Astrosclerin-3
Type:
PROTEIN
Mol. Mass.:
33233.07
Organism:
Astrosclera willeyana
Description:
ChEMBL_801827
Residue:
292
  
Inhibitor
Name:
BDBM10875
Synonyms:
5-(2-chlorophenyl)-1,3,4-thiadiazole-2-sulfonamide Chlorzolamide, CHL JMC523116 Compound 19 | aromatic/heteroaromatic sulfonamide 20
Type:
Small organic molecule
Emp. Form.:
C8H6ClN3O2S2
Mol. Mass.:
275.735
SMILES:
NS(=O)(=O)c1nnc(s1)-c1ccccc1Cl
: