Target
Insulin receptor
Ligand
BDBM50363711
Substrate
Meas. Tech.
ChEMBL_801839 (CHEMBL1947451)
IC50
3±n/a nM
Citation
 Cisek, KKuret, J QSAR studies for prediction of cross-ß sheet aggregate binding affinity and selectivity. Bioorg Med Chem 20:1434-41 (2012)  
Target
Name:
Insulin receptor
Synonyms:
INSR INSR_HUMAN Insulin receptor beta subunit
Type:
Receptor Tyrosine Kinase
Mol. Mass.:
156322.60
Organism:
Homo sapiens (Human)
Description:
P06213
Residue:
1382
  
Inhibitor
Name:
BDBM50363711
Synonyms:
CHEMBL370967
Type:
Small organic molecule
Emp. Form.:
C18H19N2S
Mol. Mass.:
295.421
SMILES:
CN(C)c1ccc(\C=C\c2sc3ccccc3[n+]2C)cc1
: