Target
Insulin receptor
Ligand
BDBM50363724
Substrate
Meas. Tech.
ChEMBL_801839 (CHEMBL1947451)
IC50
12±n/a nM
Citation
 Cisek, KKuret, J QSAR studies for prediction of cross-ß sheet aggregate binding affinity and selectivity. Bioorg Med Chem 20:1434-41 (2012)  
Target
Name:
Insulin receptor
Synonyms:
INSR INSR_HUMAN Insulin receptor beta subunit
Type:
Receptor Tyrosine Kinase
Mol. Mass.:
156322.60
Organism:
Homo sapiens (Human)
Description:
P06213
Residue:
1382
  
Inhibitor
Name:
BDBM50363724
Synonyms:
CHEMBL1944962
Type:
Small organic molecule
Emp. Form.:
C20H21N2S
Mol. Mass.:
321.459
SMILES:
CN(C)c1ccc(\C=C\c2sc3ccccc3[n+]2C2CC2)cc1
: