Target
Insulin receptor
Ligand
BDBM50363714
Substrate
Meas. Tech.
ChEMBL_801839 (CHEMBL1947451)
IC50
7.5±n/a nM
Citation
 Cisek, KKuret, J QSAR studies for prediction of cross-ß sheet aggregate binding affinity and selectivity. Bioorg Med Chem 20:1434-41 (2012)  
Target
Name:
Insulin receptor
Synonyms:
INSR INSR_HUMAN Insulin receptor beta subunit
Type:
Receptor Tyrosine Kinase
Mol. Mass.:
156322.60
Organism:
Homo sapiens (Human)
Description:
P06213
Residue:
1382
  
Inhibitor
Name:
BDBM50363714
Synonyms:
CHEMBL1944954
Type:
Small organic molecule
Emp. Form.:
C19H21N2S
Mol. Mass.:
309.448
SMILES:
CN(C)c1ccc(\C=C\c2sc3ccc(C)cc3[n+]2C)cc1
: