Target
Sphingosine 1-phosphate receptor 1
Ligand
BDBM50363937
Substrate
Meas. Tech.
ChEMBL_802535 (CHEMBL1952571)
EC50
1.8±n/a nM
Citation
 Nishi, TMiyazaki, STakemoto, TSuzuki, KIio, YNakajima, KOhnuki, TKawase, YNara, FInaba, SIzumi, TYuita, HOshima, KDoi, HInoue, RTomisato, WKagari, TShimozato, T Discovery of CS-0777: A Potent, Selective, and Orally Active S1P1 Agonist. ACS Med Chem Lett 2:368-372 (2011)  
Target
Name:
Sphingosine 1-phosphate receptor 1
Synonyms:
CD_antigen=CD363 Endothelial differentiation G-protein coupled receptor 1 S1P receptor Edg-1 S1PR1_RAT Sphingosine 1-phosphate receptor Edg-1
Type:
PROTEIN
Mol. Mass.:
42770.88
Organism:
Rattus norvegicus
Description:
ChEMBL_1463793
Residue:
383
  
Inhibitor
Name:
BDBM50363937
Synonyms:
CHEMBL1951588
Type:
Small organic molecule
Emp. Form.:
C21H31N2O5P
Mol. Mass.:
422.455
SMILES:
Cc1ccc(CCCC(=O)c2ccc(CC[C@@](C)(N)COP(O)(O)=O)n2C)cc1
: