Target
C-X-C chemokine receptor type 4
Ligand
BDBM50363974
Substrate
Meas. Tech.
ChEMBL_803952 (CHEMBL1954783)
IC50
2±n/a nM
Citation
 Demmer, ODijkgraaf, ISchumacher, UMarinelli, LCosconati, SGourni, EWester, HJKessler, H Design, synthesis, and functionalization of dimeric peptides targeting chemokine receptor CXCR4. J Med Chem 54:7648-62 (2011)  
Target
Name:
C-X-C chemokine receptor type 4
Synonyms:
C-X-C chemokine receptor type 4 CD_antigen=CD184 CXCR-4 CXCR4_HUMAN Fusin LCR1 Leukocyte-derived seven transmembrane domain receptor SDF-1 receptor | Stromal cell-derived factor 1 receptor
Type:
Enzyme
Mol. Mass.:
39754.61
Organism:
Homo sapiens (Human)
Description:
P61073
Residue:
352
  
Inhibitor
Name:
BDBM50363974
Synonyms:
CHEMBL1949739
Type:
Small organic molecule
Emp. Form.:
C82H108N18O14
Mol. Mass.:
1569.8471
SMILES:
[#6]-[#7]-1-[#6@H](-[#6]-[#6]-[#6]-[#7]-[#6](=O)-[#6]-[#6]-[#6]-[#6]-[#6]-[#6]-[#6]-[#6]-[#6](=O)-[#7]-[#6]-[#6]-[#6]-[#6@H]-2-[#7](-[#6])-[#6](=O)-[#6@@H](-[#6]-c3ccc(-[#8])cc3)-[#7]-[#6](=O)-[#6]-[#7]-[#6](=O)-[#6@H](-[#6]-c3ccc4ccccc4c3)-[#7]-[#6](=O)-[#6@H](-[#6]-[#6]-[#6]\[#7]=[#6](\[#7])-[#7])-[#7]-[#6]-2=O)-[#6](=O)-[#7]-[#6@@H](-[#6]-[#6]-[#6]\[#7]=[#6](\[#7])-[#7])-[#6](=O)-[#7]-[#6@@H](-[#6]-c2ccc3ccccc3c2)-[#6](=O)-[#7]-[#6]-[#6](=O)-[#7]-[#6@H](-[#6]-c2ccc(-[#8])cc2)-[#6]-1=O
: