Target
Adenosine receptor A2a
Ligand
BDBM50364043
Substrate
Meas. Tech.
ChEMBL_805333 (CHEMBL1955226)
Ki
58.5±n/a nM
Citation
 Deflorian, FKumar, TSPhan, KGao, ZGXu, FWu, HKatritch, VStevens, RCJacobson, KA Evaluation of molecular modeling of agonist binding in light of the crystallographic structure of an agonist-bound A2A adenosine receptor. J Med Chem 55:538-52 (2012)  
Target
Name:
Adenosine receptor A2a
Synonyms:
A2A adenosine receptor (hA2A) ADENOSINE A2 ADORA2 Adenosine A2A receptor (A2AAR)
Type:
G Protein-Coupled Receptor (GPCR)
Mol. Mass.:
44716.46
Organism:
Homo sapiens (Human)
Description:
P29274
Residue:
412
  
Inhibitor
Name:
BDBM50364043
Synonyms:
CHEMBL1950553
Type:
Small organic molecule
Emp. Form.:
C18H20ClN5O5
Mol. Mass.:
421.835
SMILES:
Nc1nc(OCCc2ccc(Cl)cc2)nc2n(cnc12)[C@@H]1O[C@H](CO)[C@@H](O)[C@H]1O
: