Target
Adenosine receptor A2a
Ligand
BDBM50009263
Substrate
Meas. Tech.
ChEMBL_805333 (CHEMBL1955226)
Ki
6.4±n/a nM
Citation
 Deflorian, FKumar, TSPhan, KGao, ZGXu, FWu, HKatritch, VStevens, RCJacobson, KA Evaluation of molecular modeling of agonist binding in light of the crystallographic structure of an agonist-bound A2A adenosine receptor. J Med Chem 55:538-52 (2012)  
Target
Name:
Adenosine receptor A2a
Synonyms:
A2A adenosine receptor (hA2A) ADENOSINE A2 ADORA2 Adenosine A2A receptor (A2AAR)
Type:
G Protein-Coupled Receptor (GPCR)
Mol. Mass.:
44716.46
Organism:
Homo sapiens (Human)
Description:
P29274
Residue:
412
  
Inhibitor
Name:
BDBM50009263
Synonyms:
(2S,3S,4R,5R)-5-(6-amino-2-(hex-1-ynyl)-9H-purin-9-yl)-N-ethyl-3,4-dihydroxy-tetrahydrofuran-2-carboxamide CHEMBL75416 | tert-butyl 1-[3-(1-amino-2-benzyloxycarbamoylethylcarboxamido)-2-hydroxy-4-phenylbutyl]tetrahydro-1H-2-pyrrolecarboxylate
Type:
Small organic molecule
Emp. Form.:
C31H42N4O7
Mol. Mass.:
582.6878
SMILES:
CC(C)(C)OC(=O)C1CCCN1CC(O)[C@H](Cc1ccccc1)NC(=O)[C@H](CC(N)=O)NC(=O)OCc1ccccc1
: