Target
Mitogen-activated protein kinase 9
Ligand
BDBM50364378
Substrate
Meas. Tech.
ChEMBL_805031 (CHEMBL1952892)
Ki
6.2±n/a nM
Target
Name:
Mitogen-activated protein kinase 9
Synonyms:
JNK-55 JNK2/JNK3 MK09_HUMAN Mitogen-activated protein kinase 8/9 SAPK1A c-Jun N-terminal kinase 2 | c-Jun N-terminal kinase 2 (JNK2)
Type:
Enzyme
Mol. Mass.:
48131.49
Organism:
Homo sapiens (Human)
Description:
JNK-2 was purchased from Upstate Cell Signaling Solutions (formerly Upstate Biotechnology).
Residue:
424
  
Inhibitor
Name:
BDBM50364378
Synonyms:
CHEMBL1950289
Type:
Small organic molecule
Emp. Form.:
C21H23F3N6O2
Mol. Mass.:
448.4415
SMILES:
O[C@H]1CC[C@@H](CC1)Nc1ncc2nc(Nc3c(F)cc(F)cc3F)n([C@H]3CCOC3)c2n1
: