Target
Lysosomal Pro-X carboxypeptidase
Ligand
BDBM50364387
Substrate
Meas. Tech.
ChEMBL_805215 (CHEMBL1955693)
IC50
0.74±n/a nM
Citation
 Wu, ZYang, CXiong, YFeng, ZLombardo, MVerras, AChabin, RMXu, STong, XXie, DLassman, MEBhatt, URGarcia-Calvo, MMGeissler, WShen, ZChen, QSinharoy, RHale, JJTata, JRPinto, SShen, DMColletti, SL Discovery of a new class of potent prolylcarboxypeptidase inhibitors derived from alanine. Bioorg Med Chem Lett 22:1774-8 (2012)  
Target
Name:
Lysosomal Pro-X carboxypeptidase
Synonyms:
Angiotensinase C PCP PRCP Prolylcarboxypeptidase | Prolylcarboxypeptidase (PRCP)
Type:
Enzyme
Mol. Mass.:
55805.19
Organism:
Homo sapiens (Human)
Description:
P42785
Residue:
496
  
Inhibitor
Name:
BDBM50364387
Synonyms:
CHEMBL1950439
Type:
Small organic molecule
Emp. Form.:
C25H27Cl2F3N4O4
Mol. Mass.:
575.407
SMILES:
C[C@H](NC(=O)[C@@H](NC(=O)C(C)(C)O)[C@@H](C)c1ccc(OCC(F)(F)F)cc1)c1nc2cc(Cl)c(Cl)cc2[nH]1
: