Target
Baculoviral IAP repeat-containing protein 2
Ligand
BDBM50364494
Substrate
Meas. Tech.
ChEMBL_802616 (CHEMBL1952923)
EC50
71±n/a nM
Citation
 Hennessy, EJSaeh, JCSha, LMacIntyre, TWang, HLarsen, NAAquila, BMFerguson, ADLaing, NMOmer, CA Discovery of aminopiperidine-based Smac mimetics as IAP antagonists. Bioorg Med Chem Lett 22:1690-4 (2012)  
Target
Name:
Baculoviral IAP repeat-containing protein 2
Synonyms:
API1 BIRC2_HUMAN Cellular inhibitor of apoptosis 1 MIHB | RNF48
Type:
Protein
Mol. Mass.:
69900.47
Organism:
Homo sapiens (Human)
Description:
Q13490
Residue:
618
  
Inhibitor
Name:
BDBM50364494
Synonyms:
CHEMBL1950856
Type:
Small organic molecule
Emp. Form.:
C23H37BrN4O2
Mol. Mass.:
481.469
SMILES:
CN[C@@H](C)C(=O)N[C@H](C(=O)N[C@H]1CCCN(CCc2ccc(Br)cc2)C1)C(C)(C)C
: