Target
Cytochrome P450 3A5
Ligand
BDBM50364639
Substrate
Meas. Tech.
ChEMBL_802674 (CHEMBL1953082)
IC50
20300±n/a nM
Citation
 Song, XLi, XRuiz, CHYin, YFeng, YKamenecka, TMCameron, MD Imidazopyridines as selective CYP3A4 inhibitors. Bioorg Med Chem Lett 22:1611-4 (2012)  
Target
Name:
Cytochrome P450 3A5
Synonyms:
CP3A5_HUMAN Cytochrome P450 3A5 | Cytochrome P450 3A5 (CYP3A5)
Type:
Protein
Mol. Mass.:
57118.00
Organism:
Homo sapiens (Human)
Description:
P20815
Residue:
502
  
Inhibitor
Name:
BDBM50364639
Synonyms:
CHEMBL1951335
Type:
Small organic molecule
Emp. Form.:
C22H20N6O2
Mol. Mass.:
400.4332
SMILES:
CCNC(=O)c1cccc(NC(=O)Nc2ccc(cc2)-c2ccnc3nc[nH]c23)c1
: