Target
Beta-2 adrenergic receptor
Ligand
BDBM50365058
Substrate
Meas. Tech.
ChEMBL_804869 (CHEMBL1953787)
EC50
0.1±n/a nM
Citation
 Shan, WJHuang, LZhou, QJiang, HLLuo, ZHLai, KFLi, XS Dualß2-adrenoceptor agonists-PDE4 inhibitors for the treatment of asthma and COPD. Bioorg Med Chem Lett 22:1523-6 (2012)  
Target
Name:
Beta-2 adrenergic receptor
Synonyms:
ADRB2_CAVPO adrenergic Beta2
Type:
Enzyme Catalytic Domain
Mol. Mass.:
46993.24
Organism:
GUINEA PIG
Description:
adrenergic Beta2 ADRB2 GUINEA PIG::Q8K4Z4
Residue:
418
  
Inhibitor
Name:
BDBM50365058
Synonyms:
CHEMBL1951067
Type:
Small organic molecule
Emp. Form.:
C29H38N4O6
Mol. Mass.:
538.6352
SMILES:
COc1ccc(cc1OC)C1=NN(CCCCNC[C@H](O)c2ccc(O)c(NC=O)c2)C(=O)C2CCCCC12
: