Target
Rho-associated protein kinase 2
Ligand
BDBM50026798
Substrate
Meas. Tech.
ChEMBL_807417 (CHEMBL1960788)
IC50
<10±n/a nM
Citation
 Doe, CBentley, RBehm, DJLafferty, RStavenger, RJung, DBamford, MPanchal, TGrygielko, EWright, LLSmith, GKChen, ZWebb, CKhandekar, SYi, TKirkpatrick, RDul, EJolivette, LMarino, JPWillette, RLee, DHu, E Novel Rho kinase inhibitors with anti-inflammatory and vasodilatory activities. J Pharmacol Exp Ther 320:89-98 (2006)  
Target
Name:
Rho-associated protein kinase 2
Synonyms:
KIAA0619 ROCK2 Rho kinase 2 (ROCKII) Rho-associated protein kinase 2 (ROCK2) Rho-associated protein kinase 2/Transforming protein RhoA Rho-associated, coiled-coil-containing protein kinase II p164 ROCK-2
Type:
Protein
Mol. Mass.:
160885.43
Organism:
Homo sapiens (Human)
Description:
O75116
Residue:
1388
  
Inhibitor
Name:
BDBM50026798
Synonyms:
CHEMBL1956072 | SB-742548
Type:
Small organic molecule
Emp. Form.:
C17H18ClN7O
Mol. Mass.:
371.824
SMILES:
Cl.CCn1c(nc2cncc(-c3ccc(CN)cc3)c12)-c1nonc1N
: