Target
Acetyl-CoA carboxylase 1
Ligand
BDBM50365281
Substrate
Meas. Tech.
ChEMBL_806322 (CHEMBL1959086)
IC50
12±n/a nM
Citation
 Freeman-Cook, KDAmor, PBader, SBuzon, LMCoffey, SBCorbett, JWDirico, KJDoran, SDElliott, RLEsler, WGuzman-Perez, AHenegar, KEHouser, JAJones, CSLimberakis, CLoomis, KMcPherson, KMurdande, SNelson, KLPhillion, DPierce, BSSong, WSugarman, ETapley, STu, MZhao, Z Maximizing lipophilic efficiency: the use of Free-Wilson analysis in the design of inhibitors of acetyl-CoA carboxylase. J Med Chem 55:935-42 (2012)  
Target
Name:
Acetyl-CoA carboxylase 1
Synonyms:
ACACA_RAT Acac Acetyl-CoA carboxylase Acetyl-CoA carboxylase 1 (ACC1)
Type:
Protein
Mol. Mass.:
265183.92
Organism:
Rattus norvegicus (Rat)
Description:
P11497
Residue:
2345
  
Inhibitor
Name:
BDBM50365281
Synonyms:
CHEMBL1958362
Type:
Small organic molecule
Emp. Form.:
C23H27N5O3
Mol. Mass.:
421.4922
SMILES:
CCn1nc2c(OC3(CCN(CC3)C(=O)c3cc(C)c4[nH]nc(C)c4c3)CC2=O)c1C
: