Target
Cyclin-dependent kinase 2
Ligand
BDBM50026860
Substrate
Meas. Tech.
ChEMBL_807302 (CHEMBL1960395)
IC50
<15849±n/a nM
Citation
 Gentile, GMerlo, GPozzan, ABernasconi, GBax, BBamborough, PBridges, ACarter, PNeu, MYao, GBrough, CCutler, GCoffin, ABelyanskaya, S 5-Aryl-4-carboxamide-1,3-oxazoles: potent and selective GSK-3 inhibitors. Bioorg Med Chem Lett 22:1989-94 (2012)  
Target
Name:
Cyclin-dependent kinase 2
Synonyms:
CDK2 CDK2_HUMAN Cell division protein kinase 2 Protein cereblon/Cyclin-dependent kinase 2 | p33 protein kinase
Type:
Enzyme Subunit
Mol. Mass.:
33938.17
Organism:
Homo sapiens (Human)
Description:
P24941
Residue:
298
  
Inhibitor
Name:
BDBM50026860
Synonyms:
CHEMBL1957097
Type:
Small organic molecule
Emp. Form.:
C22H16ClN3O3
Mol. Mass.:
405.834
SMILES:
Clc1cc(ccc1Oc1ccccc1)-c1ocnc1C(=O)NCc1ccncc1
: