Target
Glycogen synthase kinase-3 beta
Ligand
BDBM50026841
Substrate
Meas. Tech.
ChEMBL_807301 (CHEMBL1960394)
IC50
1995±n/a nM
Citation
 Gentile, GMerlo, GPozzan, ABernasconi, GBax, BBamborough, PBridges, ACarter, PNeu, MYao, GBrough, CCutler, GCoffin, ABelyanskaya, S 5-Aryl-4-carboxamide-1,3-oxazoles: potent and selective GSK-3 inhibitors. Bioorg Med Chem Lett 22:1989-94 (2012)  
Target
Name:
Glycogen synthase kinase-3 beta
Synonyms:
GSK-3 beta GSK3B Glycogen synthase kinase 3 beta (GSK3B) Glycogen synthase kinase-3 beta (GSK-3B) Glycogen synthase kinase-3 beta (GSK3B) Glycogen synthase kinase-3beta (GSK3B) | Serine/threonine-protein kinase GSK3B
Type:
Enzyme
Mol. Mass.:
46756.38
Organism:
Homo sapiens (Human)
Description:
P49841
Residue:
420
  
Inhibitor
Name:
BDBM50026841
Synonyms:
CHEMBL1957099
Type:
Small organic molecule
Emp. Form.:
C16H13ClN4O3
Mol. Mass.:
344.752
SMILES:
COc1ncc(cc1Cl)-c1ocnc1C(=O)NCc1ccncc1
: