Target
Glycogen synthase kinase-3 beta
Ligand
BDBM50365605
Substrate
Meas. Tech.
ChEMBL_808205 (CHEMBL1961117)
EC50
95±n/a nM
Citation
 Lee, SCShin, DCho, JMRo, SSuh, YG Structure-activity relationship of the 7-hydroxy benzimidazole analogs as glycogen synthase kinase 3ß inhibitor. Bioorg Med Chem Lett 22:1891-4 (2012)  
Target
Name:
Glycogen synthase kinase-3 beta
Synonyms:
GSK-3 beta GSK3B Glycogen synthase kinase 3 beta (GSK3B) Glycogen synthase kinase-3 beta (GSK-3B) Glycogen synthase kinase-3 beta (GSK3B) Glycogen synthase kinase-3beta (GSK3B) | Serine/threonine-protein kinase GSK3B
Type:
Enzyme
Mol. Mass.:
46756.38
Organism:
Homo sapiens (Human)
Description:
P49841
Residue:
420
  
Inhibitor
Name:
BDBM50365605
Synonyms:
CHEMBL1957952
Type:
Small organic molecule
Emp. Form.:
C29H25FN4O4S
Mol. Mass.:
544.597
SMILES:
Cc1ccc(cc1)S(=O)(=O)Nc1ccc(CCNC(=O)c2ccc(O)c3nc([nH]c23)-c2ccc(F)cc2)cc1
: