Target
Glycogen synthase kinase-3 beta
Ligand
BDBM50365607
Substrate
Meas. Tech.
ChEMBL_808205 (CHEMBL1961117)
EC50
240±n/a nM
Citation
 Lee, SCShin, DCho, JMRo, SSuh, YG Structure-activity relationship of the 7-hydroxy benzimidazole analogs as glycogen synthase kinase 3ß inhibitor. Bioorg Med Chem Lett 22:1891-4 (2012)  
Target
Name:
Glycogen synthase kinase-3 beta
Synonyms:
GSK-3 beta GSK3B Glycogen synthase kinase 3 beta (GSK3B) Glycogen synthase kinase-3 beta (GSK-3B) Glycogen synthase kinase-3 beta (GSK3B) Glycogen synthase kinase-3beta (GSK3B) | Serine/threonine-protein kinase GSK3B
Type:
Enzyme
Mol. Mass.:
46756.38
Organism:
Homo sapiens (Human)
Description:
P49841
Residue:
420
  
Inhibitor
Name:
BDBM50365607
Synonyms:
CHEMBL1957954
Type:
Small organic molecule
Emp. Form.:
C20H17Cl2N5O2
Mol. Mass.:
430.287
SMILES:
Oc1ccc(C(=O)NCCCn2ccnc2)c2[nH]c(nc12)-c1ccc(Cl)cc1Cl
: