Target
Glycogen synthase kinase-3 beta
Ligand
BDBM50365614
Substrate
Meas. Tech.
ChEMBL_808205 (CHEMBL1961117)
EC50
34±n/a nM
Citation
 Lee, SCShin, DCho, JMRo, SSuh, YG Structure-activity relationship of the 7-hydroxy benzimidazole analogs as glycogen synthase kinase 3ß inhibitor. Bioorg Med Chem Lett 22:1891-4 (2012)  
Target
Name:
Glycogen synthase kinase-3 beta
Synonyms:
GSK-3 beta GSK3B Glycogen synthase kinase 3 beta (GSK3B) Glycogen synthase kinase-3 beta (GSK-3B) Glycogen synthase kinase-3 beta (GSK3B) Glycogen synthase kinase-3beta (GSK3B) | Serine/threonine-protein kinase GSK3B
Type:
Enzyme
Mol. Mass.:
46756.38
Organism:
Homo sapiens (Human)
Description:
P49841
Residue:
420
  
Inhibitor
Name:
BDBM50365614
Synonyms:
CHEMBL1957959
Type:
Small organic molecule
Emp. Form.:
C18H15Cl2N5O2S
Mol. Mass.:
436.315
SMILES:
Oc1ccc(C(=O)NCCCn2cnc(Cl)c2Cl)c2[nH]c(nc12)-c1cccs1
: