Target
MAP kinase-activated protein kinase 5
Ligand
BDBM50365798
Substrate
Meas. Tech.
ChEMBL_806119 (CHEMBL1960722)
IC50
88±n/a nM
Citation
 Andrews, MJClase, JABar, GTricarico, GEdwards, PJBrys, RChambers, MSchmidt, WMacLeod, AHirst, KAllen, VBirault, VLe, JHarris, JSelf, ANash, KDixon, G Discovery of a series of imidazopyrazine small molecule inhibitors of the kinase MAPKAPK5, that show activity using in vitro and in vivo models of rheumatoid arthritis. Bioorg Med Chem Lett 22:2266-70 (2012)  
Target
Name:
MAP kinase-activated protein kinase 5
Synonyms:
MAP kinase-activated protein kinase 5 (PRAK) MAPK-activated protein kinase 5 MAPKAP kinase 5 PRAK p38-regulated/activated protein kinase (PRAK)
Type:
Serine/threonine-protein kinase
Mol. Mass.:
54229.92
Organism:
Homo sapiens (Human)
Description:
Recombinant MAPKAPK5 was phosphorylated by incubation with active p38alpha before assays.
Residue:
473
  
Inhibitor
Name:
BDBM50365798
Synonyms:
CHEMBL1956685
Type:
Small organic molecule
Emp. Form.:
C21H20N6O3
Mol. Mass.:
404.4219
SMILES:
NC(=O)c1cc(co1)-c1cnc(Nc2ccc(cc2)N2CCOCC2)c2nccn12
: