Target
Carbonic anhydrase 2
Ligand
BDBM50366069
Substrate
Meas. Tech.
ChEMBL_807743 (CHEMBL1959871)
Ki
7±n/a nM
Citation
 Moeker, JTeruya, KRossit, SWilkinson, BLLopez, MBornaghi, LFInnocenti, ASupuran, CTPoulsen, SA Design and synthesis of thiourea compounds that inhibit transmembrane anchored carbonic anhydrases. Bioorg Med Chem 20:2392-404 (2012)  
Target
Name:
Carbonic anhydrase 2
Synonyms:
CA-II CAC Carbonate dehydratase II Carbonic anhydrase 2 (CA-II) Carbonic anhydrase C Carbonic anhydrase II (CA-II) Carbonic anhydrase II (hCA II) | Carbonic anhydrase isoenzyme II (hCA II)
Type:
Enzyme
Mol. Mass.:
29250.71
Organism:
Homo sapiens (Human)
Description:
P00918
Residue:
260
  
Inhibitor
Name:
BDBM50366069
Synonyms:
CHEMBL1956743
Type:
Small organic molecule
Emp. Form.:
C21H27N3O11S2
Mol. Mass.:
561.583
SMILES:
CC(=O)OC[C@H]1O[C@@H](NC(=S)Nc2ccc(cc2)S(N)(=O)=O)[C@H](OC(C)=O)[C@@H](OC(C)=O)[C@@H]1OC(C)=O
: