Target
Carbonic anhydrase 9
Ligand
BDBM50366050
Substrate
Meas. Tech.
ChEMBL_807744 (CHEMBL1959872)
Ki
7.3±n/a nM
Citation
 Moeker, JTeruya, KRossit, SWilkinson, BLLopez, MBornaghi, LFInnocenti, ASupuran, CTPoulsen, SA Design and synthesis of thiourea compounds that inhibit transmembrane anchored carbonic anhydrases. Bioorg Med Chem 20:2392-404 (2012)  
Target
Name:
Carbonic anhydrase 9
Synonyms:
CA-IX CAH9_HUMAN Carbonic anhydrase 9 (CA IX) Carbonic anhydrase 9 precursor Carbonic anhydrase IX (CAIX) Carbonic anhydrases; II & IX MN RCC-associated antigen G250
Type:
Enzyme
Mol. Mass.:
49669.03
Organism:
Homo sapiens (Human)
Description:
Catalytic domain of human cloned isozyme was used in the assay
Residue:
459
  
Inhibitor
Name:
BDBM50366050
Synonyms:
CHEMBL1956756
Type:
Small organic molecule
Emp. Form.:
C34H45N3O19S2
Mol. Mass.:
863.86
SMILES:
CC(=O)OC[C@H]1O[C@@H](NC(=S)NCc2ccc(cc2)S(N)(=O)=O)[C@H](OC(C)=O)[C@@H](OC(C)=O)[C@@H]1O[C@@H]1O[C@H](COC(C)=O)[C@H](OC(C)=O)[C@H](OC(C)=O)[C@H]1OC(C)=O
: