Target
Carbonic anhydrase 12
Ligand
BDBM50366054
Substrate
Meas. Tech.
ChEMBL_807745 (CHEMBL1959873)
Ki
8.2±n/a nM
Citation
 Moeker, JTeruya, KRossit, SWilkinson, BLLopez, MBornaghi, LFInnocenti, ASupuran, CTPoulsen, SA Design and synthesis of thiourea compounds that inhibit transmembrane anchored carbonic anhydrases. Bioorg Med Chem 20:2392-404 (2012)  
Target
Name:
Carbonic anhydrase 12
Synonyms:
CA-XII CAH12_HUMAN Carbonic anhydrase Carbonic anhydrase XII Carbonic anhydrase XII (CAXII) | Tumor antigen HOM-RCC-3.1.3
Type:
Enzyme
Mol. Mass.:
39456.00
Organism:
Homo sapiens (Human)
Description:
Catalytic domain of human cloned isozyme was used in the assay
Residue:
354
  
Inhibitor
Name:
BDBM50366054
Synonyms:
CHEMBL1956760
Type:
Small organic molecule
Emp. Form.:
C14H21N3O7S2
Mol. Mass.:
407.462
SMILES:
NS(=O)(=O)c1ccc(CNC(=S)N[C@@H]2O[C@H](CO)[C@@H](O)[C@H](O)[C@H]2O)cc1
: